Skip to content

TensorRT 8.5.2 PASS but TensorRT 10.4.0 FAILED #6778

TensorRT 8.5.2 PASS but TensorRT 10.4.0 FAILED

TensorRT 8.5.2 PASS but TensorRT 10.4.0 FAILED #6778

Triggered via issue January 23, 2025 01:33
@lix19937lix19937
commented on #4334 97ff244
Status Skipped
Total duration 3s
Artifacts

blossom-ci.yml

on: issue_comment
Authorization
0s
Authorization
Upload log
0s
Upload log
Vulnerability scan
0s
Vulnerability scan
Start ci job
0s
Start ci job
Fit to window
Zoom out
Zoom in