Skip to content

fix(MIPS): improve analysis for HI16/LO16 pairs #125

fix(MIPS): improve analysis for HI16/LO16 pairs

fix(MIPS): improve analysis for HI16/LO16 pairs #125

Triggered via push May 2, 2024 16:51
Status Failure
Total duration 3m 59s
Artifacts 4

ci.yaml

on: push
Matrix: build
release
0s
release
Fit to window
Zoom out
Zoom in

Annotations

8 errors and 9 warnings
ghidra.app.analyzers.relocations.arch.mipsel.hi16_lo16_multiple_addends_Test ► testRelocationTableSynthesizerAnalyzer: src/test/java/ghidra/DelinkerIntegrationTest.java#L109
Failed test found in: build/test-results/test/TEST-ghidra.app.analyzers.relocations.arch.mipsel.hi16_lo16_multiple_addends_Test.xml build/test-results/test/TEST-ghidra.app.analyzers.relocations.arch.mipsel.hi16_lo16_unrelated_registers_Test.xml build/test-results/test/TEST-ghidra.app.analyzers.relocations.arch.mipsel.hi16_move_lo16_Test.xml Error: ghidra.util.exception.VersionException: data created with newer version and can not be read
build (10.4)
Failed test were found and 'fail-on-error' option is set to true
build (10.4)
The process '/usr/bin/xvfb-run' failed with exit code 1
ghidra.app.analyzers.relocations.arch.mipsel.hi16_lo16_multiple_addends_Test ► testRelocationTableSynthesizerAnalyzer: src/test/java/ghidra/DelinkerIntegrationTest.java#L109
Failed test found in: build/test-results/test/TEST-ghidra.app.analyzers.relocations.arch.mipsel.hi16_lo16_multiple_addends_Test.xml build/test-results/test/TEST-ghidra.app.analyzers.relocations.arch.mipsel.hi16_lo16_unrelated_registers_Test.xml build/test-results/test/TEST-ghidra.app.analyzers.relocations.arch.mipsel.hi16_move_lo16_Test.xml Error: ghidra.util.exception.VersionException: data created with newer version and can not be read
ghidra.app.analyzers.relocations.arch.mipsel.hi16_lo16_multiple_addends_Test ► testRelocationTableSynthesizerAnalyzer: src/test/java/ghidra/DelinkerIntegrationTest.java#L109
Failed test found in: build/test-results/test/TEST-ghidra.app.analyzers.relocations.arch.mipsel.hi16_lo16_multiple_addends_Test.xml build/test-results/test/TEST-ghidra.app.analyzers.relocations.arch.mipsel.hi16_lo16_unrelated_registers_Test.xml build/test-results/test/TEST-ghidra.app.analyzers.relocations.arch.mipsel.hi16_move_lo16_Test.xml Error: ghidra.util.exception.VersionException: data created with newer version and can not be read
ghidra.app.analyzers.relocations.arch.mipsel.hi16_lo16_multiple_addends_Test ► testRelocationTableSynthesizerAnalyzer: src/test/java/ghidra/DelinkerIntegrationTest.java#L109
Failed test found in: build/test-results/test/TEST-ghidra.app.analyzers.relocations.arch.mipsel.hi16_lo16_multiple_addends_Test.xml build/test-results/test/TEST-ghidra.app.analyzers.relocations.arch.mipsel.hi16_lo16_unrelated_registers_Test.xml build/test-results/test/TEST-ghidra.app.analyzers.relocations.arch.mipsel.hi16_move_lo16_Test.xml Error: ghidra.util.exception.VersionException: data created with newer version and can not be read
build (10.3.3)
Failed test were found and 'fail-on-error' option is set to true
build (10.3.3)
The process '/usr/bin/xvfb-run' failed with exit code 1
spotless
Node.js 16 actions are deprecated. Please update the following actions to use Node.js 20: actions/checkout@v3, actions/setup-java@v3, er28-0652/setup-ghidra@master. For more information see: https://github.blog/changelog/2023-09-22-github-actions-transitioning-from-node-16-to-node-20/.
spotless
The following actions uses node12 which is deprecated and will be forced to run on node16: er28-0652/setup-ghidra@master. For more info: https://github.blog/changelog/2023-06-13-github-actions-all-actions-will-run-on-node16-instead-of-node12-by-default/
build (10.4)
Node.js 16 actions are deprecated. Please update the following actions to use Node.js 20: actions/checkout@v3, actions/setup-java@v3, er28-0652/setup-ghidra@master, actions/upload-artifact@v3, coactions/setup-xvfb@v1. For more information see: https://github.blog/changelog/2023-09-22-github-actions-transitioning-from-node-16-to-node-20/.
build (10.4)
The following actions uses node12 which is deprecated and will be forced to run on node16: er28-0652/setup-ghidra@master. For more info: https://github.blog/changelog/2023-06-13-github-actions-all-actions-will-run-on-node16-instead-of-node12-by-default/
build (10.3.3)
Node.js 16 actions are deprecated. Please update the following actions to use Node.js 20: actions/checkout@v3, actions/setup-java@v3, er28-0652/setup-ghidra@master, actions/upload-artifact@v3, coactions/setup-xvfb@v1. For more information see: https://github.blog/changelog/2023-09-22-github-actions-transitioning-from-node-16-to-node-20/.
build (10.3.3)
The following actions uses node12 which is deprecated and will be forced to run on node16: er28-0652/setup-ghidra@master. For more info: https://github.blog/changelog/2023-06-13-github-actions-all-actions-will-run-on-node16-instead-of-node12-by-default/
build (11.0)
Node.js 16 actions are deprecated. Please update the following actions to use Node.js 20: actions/checkout@v3, actions/setup-java@v3, er28-0652/setup-ghidra@master, actions/upload-artifact@v3, coactions/setup-xvfb@v1. For more information see: https://github.blog/changelog/2023-09-22-github-actions-transitioning-from-node-16-to-node-20/.
build (11.0)
The following actions uses node12 which is deprecated and will be forced to run on node16: er28-0652/setup-ghidra@master. For more info: https://github.blog/changelog/2023-06-13-github-actions-all-actions-will-run-on-node16-instead-of-node12-by-default/
Deprecation notice: v1, v2, and v3 of the artifact actions
The following artifacts were uploaded using a version of actions/upload-artifact that is scheduled for deprecation: "artifact", "reports (10.3.3)", "reports (10.4)", "reports (11.0)". Please update your workflow to use v4 of the artifact actions. Learn more: https://github.blog/changelog/2024-04-16-deprecation-notice-v3-of-the-artifact-actions/

Artifacts

Produced during runtime
Name Size
artifact Expired
1.23 MB
reports (10.3.3) Expired
73 KB
reports (10.4) Expired
72.9 KB
reports (11.0) Expired
2.09 MB