wip #494
build-and-test.yml
on: push
Check formatting
43s
Build and validate the tutorial
1m 34s
Matrix: Build
Annotations
10 errors and 15 warnings
io.chymyst.dhall.unit.PerfTest ► parse Prelude/JSON/renderAs.dhall:
scall-cli/src/test/scala/io/chymyst/dhall/unit/PerfTest.scala#L42
Failed test found in:
scall-cli/target/test-reports/TEST-io.chymyst.dhall.unit.PerfTest.xml
Error:
sbt.ForkMain$ForkError: java.util.NoSuchElementException: None.get
|
io.chymyst.dhall.unit.PerfTest ► parse largeExpressionA.dhall:
scall-cli/src/test/scala/io/chymyst/dhall/unit/PerfTest.scala#L48
Failed test found in:
scall-cli/target/test-reports/TEST-io.chymyst.dhall.unit.PerfTest.xml
Error:
sbt.ForkMain$ForkError: java.util.NoSuchElementException: None.get
|
io.chymyst.dhall.unit.DoNotationTest ► parse do notation and detect error 1:
scall-core/src/test/scala/io/chymyst/dhall/unit/DoNotationTest.scala#L110
Failed test found in:
scall-core/target/test-reports/TEST-io.chymyst.dhall.unit.DoNotationTest.xml
Error:
sbt.ForkMain$ForkError: java.lang.AssertionError: assertion failed
|
io.chymyst.dhall.unit.DoNotationTest ► parse do notation and detect error 2:
scall-core/src/test/scala/io/chymyst/dhall/unit/DoNotationTest.scala#L118
Failed test found in:
scall-core/target/test-reports/TEST-io.chymyst.dhall.unit.DoNotationTest.xml
Error:
sbt.ForkMain$ForkError: java.lang.AssertionError: assertion failed
|
io.chymyst.dhall.unit.SimpleExpressionTest ► simple expression: x:
scall-core/src/test/scala/io/chymyst/dhall/unit/SimpleExpressionTest.scala#L36
Failed test found in:
scall-core/target/test-reports/TEST-io.chymyst.dhall.unit.SimpleExpressionTest.xml
Error:
sbt.ForkMain$ForkError: java.lang.AssertionError: assertion failed
|
io.chymyst.dhall.unit.SimpleExpressionTest ► simple expression: let x = 1 in x with hand-written grammar:
scall-core/src/test/scala/io/chymyst/dhall/unit/SimpleExpressionTest.scala#L40
Failed test found in:
scall-core/target/test-reports/TEST-io.chymyst.dhall.unit.SimpleExpressionTest.xml
Error:
sbt.ForkMain$ForkError: java.lang.AssertionError: assertion failed
|
Build (22.0.1, 2.13.13)
Failed test were found and 'fail-on-error' option is set to true
|
Build (22.0.1, 2.13.13)
Process completed with exit code 1.
|
Build (8.0.382, 2.13.13)
The job was canceled because "_22_0_1_2_13_13" failed.
|
Build (8.0.382, 2.13.13)
The operation was canceled.
|
Check formatting
The following actions uses node12 which is deprecated and will be forced to run on node16: actions/checkout@v2, actions/[email protected]. For more info: https://github.blog/changelog/2023-06-13-github-actions-all-actions-will-run-on-node16-instead-of-node12-by-default/
|
Check formatting
The following actions uses Node.js version which is deprecated and will be forced to run on node20: actions/checkout@v2, actions/cache@v3, actions/[email protected]. For more info: https://github.blog/changelog/2024-03-07-github-actions-all-actions-will-run-on-node20-instead-of-node16-by-default/
|
Check formatting
The `set-output` command is deprecated and will be disabled soon. Please upgrade to using Environment Files. For more information see: https://github.blog/changelog/2022-10-11-github-actions-deprecating-save-state-and-set-output-commands/
|
Check formatting
The `set-output` command is deprecated and will be disabled soon. Please upgrade to using Environment Files. For more information see: https://github.blog/changelog/2022-10-11-github-actions-deprecating-save-state-and-set-output-commands/
|
Build and validate the tutorial
The following actions uses node12 which is deprecated and will be forced to run on node16: actions/checkout@v2, actions/[email protected], actions/upload-artifact@v2. For more info: https://github.blog/changelog/2023-06-13-github-actions-all-actions-will-run-on-node16-instead-of-node12-by-default/
|
Build and validate the tutorial
The following actions uses Node.js version which is deprecated and will be forced to run on node20: actions/checkout@v2, actions/cache@v3, actions/[email protected], actions/upload-artifact@v2. For more info: https://github.blog/changelog/2024-03-07-github-actions-all-actions-will-run-on-node20-instead-of-node16-by-default/
|
Build and validate the tutorial
The `set-output` command is deprecated and will be disabled soon. Please upgrade to using Environment Files. For more information see: https://github.blog/changelog/2022-10-11-github-actions-deprecating-save-state-and-set-output-commands/
|
Build and validate the tutorial
The `set-output` command is deprecated and will be disabled soon. Please upgrade to using Environment Files. For more information see: https://github.blog/changelog/2022-10-11-github-actions-deprecating-save-state-and-set-output-commands/
|
Build (22.0.1, 2.13.13)
The following actions uses node12 which is deprecated and will be forced to run on node16: actions/checkout@v2, actions/[email protected]. For more info: https://github.blog/changelog/2023-06-13-github-actions-all-actions-will-run-on-node16-instead-of-node12-by-default/
|
Build (22.0.1, 2.13.13)
The following actions uses Node.js version which is deprecated and will be forced to run on node20: actions/checkout@v2, actions/cache@v3, actions/[email protected], dorny/[email protected]. For more info: https://github.blog/changelog/2024-03-07-github-actions-all-actions-will-run-on-node20-instead-of-node16-by-default/
|
Build (22.0.1, 2.13.13)
The `set-output` command is deprecated and will be disabled soon. Please upgrade to using Environment Files. For more information see: https://github.blog/changelog/2022-10-11-github-actions-deprecating-save-state-and-set-output-commands/
|
Build (22.0.1, 2.13.13)
The `set-output` command is deprecated and will be disabled soon. Please upgrade to using Environment Files. For more information see: https://github.blog/changelog/2022-10-11-github-actions-deprecating-save-state-and-set-output-commands/
|
Build (8.0.382, 2.13.13)
The `set-output` command is deprecated and will be disabled soon. Please upgrade to using Environment Files. For more information see: https://github.blog/changelog/2022-10-11-github-actions-deprecating-save-state-and-set-output-commands/
|
Build (8.0.382, 2.13.13)
The `set-output` command is deprecated and will be disabled soon. Please upgrade to using Environment Files. For more information see: https://github.blog/changelog/2022-10-11-github-actions-deprecating-save-state-and-set-output-commands/
|
Deprecation notice: v1, v2, and v3 of the artifact actions
The following artifacts were uploaded using a version of actions/upload-artifact that is scheduled for deprecation: "Tutorial PDF file and logs".
Please update your workflow to use v4 of the artifact actions.
Learn more: https://github.blog/changelog/2024-04-16-deprecation-notice-v3-of-the-artifact-actions/
|
Artifacts
Produced during runtime
Name | Size | |
---|---|---|
Tutorial PDF file and logs
Expired
|
943 KB |
|